{"text_format":"1","workbook":"xlsx","n_sheets":12,"sheets":["Title","Assumptions","Overview","ICS","Trust","Data (to be hidden)","Next steps","Create a report","ICS report","Trust report","Report of both","References"],"not_rendered":{"charts":8,"images":55,"macros":1,"external_links":1,"defined_names":2,"comments":0,"pivot_tables":0},"unopened":[],"bounds":{"document_bytes":16777216,"sheet_cells":100000,"rows_first":2000,"rows_last":500,"rows_between":2000,"halvings":0,"cell_chars":16384,"cell_head_chars":4096},"cells_cut":0,"cells_raw":0,"read":"whole","date_system":"1900"}

{"sheet":"Title","index":0,"n_rows":42,"n_cols":21,"rows_kept":42,"cut":false,"hidden":false,"merged":[]}
[]
[]
[]
[]
[]
[]
[]
[]
[]
[]
[]
[]
[]
[]
[]
[]
[]
[]
[]
[]
{"$rows_left_out":23}
{"sheet":"Assumptions","index":1,"n_rows":0,"n_cols":0,"rows_kept":0,"cut":false,"hidden":false,"merged":[]}

{"sheet":"Overview","index":2,"n_rows":0,"n_cols":0,"rows_kept":0,"cut":false,"hidden":false,"merged":[]}

{"sheet":"ICS","index":3,"n_rows":46,"n_cols":14,"rows_kept":46,"cut":false,"hidden":false,"merged":[[39,4,39,5],[45,4,45,5],[26,10,27,11],[26,13,27,14],[35,2,35,15],[43,4,43,5],[41,4,41,5],[3,2,3,15],[6,3,6,5],[16,2,16,15],[21,10,22,11],[21,13,22,14],[6,7,6,14],[8,7,8,14]]}
[]
[]
[]
[null,null,"ICS Overview 23-24 (2)"]
[]
[]
[null,null,null,null,null,null,null,"ICS"]
[]
[null,null,null,null,null,null,null,"Joined up care Derbyshire (I19)"]
[]
[]
[]
[]
[]
[]
[]
[null,null,"Costs associated with COPD non-elective admissions"]
[]
[null,null,null,null,"Severe exacerbations (9)"]
[]
{"$rows_left_out":27}
{"sheet":"Trust","index":4,"n_rows":46,"n_cols":14,"rows_kept":46,"cut":false,"hidden":false,"merged":[[39,4,39,5],[45,4,45,5],[16,2,16,15],[35,2,35,15],[3,2,3,15],[6,3,6,5],[26,10,27,11],[21,10,22,11],[21,13,22,14],[26,13,27,14],[6,7,6,14],[8,7,8,14],[41,4,41,5],[43,4,43,5]]}
[]
[]
[]
[null,null,"Trust Overview 23-24 (2)"]
[]
[]
[null,null,null,null,null,null,null,"Trust"]
[]
[null,null,null,null,null,null,null,"UNIVERSITY HOSPITALS OF NORTH MIDLANDS NHS TRUST"]
[]
[]
[]
[]
[]
[]
[]
[null,null,"Costs associated with COPD"]
[]
[null,null,null,null,"Severe exacerbations (9)"]
[]
{"$rows_left_out":27}
{"sheet":"Data (to be hidden)","index":5,"n_rows":149,"n_cols":34,"rows_kept":149,"cut":false,"hidden":true,"merged":[[2,1,2,2],[6,1,6,2],[6,5,6,6],[6,9,6,10],[25,4,27,4],[20,1,20,2],[24,1,24,2],[24,5,24,6],[24,9,24,10]]}
[]
[]
[null,"Selected ICS Data",null,null,null,null,null,null,null,null,null,null,null,null,"Provider Trust","Admissions","Patients","Total Bed days","Avg. Bed Days","Avg. Cost","Average Admissions per Patient","% Readmitted within 30 days","% Readmitted within 90 days",null,"ICS Provider View","Total Bed Days (sum)","Total Bed Days (average)","Total Cost (sum)","Patient (count)","Admissions (count)","Admissions per patient","Total Cost (average)","% Readmitted within 30 days","% Readmitted within 90 days"]
[null,null,null,null,null,null,null,null,null,null,null,null,null,null,"AIREDALE NHS FOUNDATION TRUST",595,340,2535,{"$f":"Trust[[#This Row],[Total Bed days]]/Trust[[#This Row],[Admissions]]","v":4.2605042016806722},1916.057474747475,{"$f":"Trust[[#This Row],[Admissions]]/Trust[[#This Row],[Patients]]","v":1.75},9.9173553719008267E-2,0.18181818181818182,null,"Bath and North East Somerset, Swindon and Wiltshire Integrated Care System (I07)",9855,{"$f":"ICS[[#This Row],[Total Bed Days (sum)]]/ICS[[#This Row],[Admissions (count)]]","v":5.3559782608695654},4102805.07,1320,1840,{"$f":"ICS[[#This Row],[Admissions (count)]]/ICS[[#This Row],[Patient (count)]]","v":1.393939393939394},2316.66,9.7368421052631576E-2,0.1736842105263158]
[null,"ICS",{"$f":"ICS!H9","v":"Joined up care Derbyshire (I19)"},null,null,null,null,null,null,null,null,null,null,null,"ALDER HEY CHILDREN'S NHS FOUNDATION TRUST",7,7,15,{"$f":"Trust[[#This Row],[Total Bed days]]/Trust[[#This Row],[Admissions]]","v":2.1428571428571428},9587.6890000000003,{"$f":"Trust[[#This Row],[Admissions]]/Trust[[#This Row],[Patients]]","v":1},"","",null,"Bedfordshire, Luton and Milton Keynes Integrated Care System (I21)",12770,{"$f":"ICS[[#This Row],[Total Bed Days (sum)]]/ICS[[#This Row],[Admissions (count)]]","v":5.995305164319249},6375459.6500000004,1375,2130,{"$f":"ICS[[#This Row],[Admissions (count)]]/ICS[[#This Row],[Patient (count)]]","v":1.5490909090909091},2994.58,8.4862385321100922E-2,0.17660550458715596]
[null,null,null,null,null,null,null,null,null,null,null,null,null,null,"ASHFORD AND ST PETER'S HOSPITALS NHS FOUNDATION TRUST",530,365,3000,{"$f":"Trust[[#This Row],[Total Bed days]]/Trust[[#This Row],[Admissions]]","v":5.6603773584905657},2830.1756053130935,{"$f":"Trust[[#This Row],[Admissions]]/Trust[[#This Row],[Patients]]","v":1.452054794520548},7.6923076923076927E-2,0.1623931623931624,null,"Birmingham and Solihull Integrated Care System (I18)",22940,{"$f":"ICS[[#This Row],[Total Bed Days (sum)]]/ICS[[#This Row],[Admissions (count)]]","v":5.1205357142857144},11373187.27,3160,4480,{"$f":"ICS[[#This Row],[Admissions (count)]]/ICS[[#This Row],[Patient (count)]]","v":1.4177215189873418},2777.34,0.10799136069114471,0.20950323974082075]
[null,"Original Population",null,null,null,"Future Population",null,null,null,"Change",null,null,null,null,"BARKING, HAVERING AND REDBRIDGE UNIVERSITY HOSPITALS NHS TRUST",1260,730,7460,{"$f":"Trust[[#This Row],[Total Bed days]]/Trust[[#This Row],[Admissions]]","v":5.9206349206349209},2763.228814638027,{"$f":"Trust[[#This Row],[Admissions]]/Trust[[#This Row],[Patients]]","v":1.726027397260274},0.13732394366197184,0.23239436619718309,null,"Bristol, North Somerset and South Gloucestershire Integrated Care System (I08)",14460,{"$f":"ICS[[#This Row],[Total Bed Days (sum)]]/ICS[[#This Row],[Admissions (count)]]","v":5.1921005385996413},5028570.5199999996,1895,2785,{"$f":"ICS[[#This Row],[Admissions (count)]]/ICS[[#This Row],[Patient (count)]]","v":1.4696569920844327},2297.1999999999998,7.8534031413612565E-2,0.15881326352530542]
[null,"Admissions",{"$f":"_xlfn.XLOOKUP(C5,ICS[ICS Provider View],ICS[Admissions (count)],\"\")","v":2350},null,null,"Eligible dupi patients",{"$f":"IF(ICS!H46>0.3226,\"\",(C9*ICS!H40)*ICS!H42)","v":255.20000000000002},null,null,"Cost",{"$f":"G15-C15","v":-444727.73452800047},null,null,null,"BARNSLEY HOSPITAL NHS FOUNDATION TRUST",1160,800,6380,{"$f":"Trust[[#This Row],[Total Bed days]]/Trust[[#This Row],[Admissions]]","v":5.5},3002.7008644366197,{"$f":"Trust[[#This Row],[Admissions]]/Trust[[#This Row],[Patients]]","v":1.45},0.10714285714285714,0.1984126984126984,null,"Buckinghamshire, Oxfordshire and Berkshire West Integrated Care System (I13)",11350,{"$f":"ICS[[#This Row],[Total Bed Days (sum)]]/ICS[[#This Row],[Admissions (count)]]","v":4.4249512670565299},5890309.04,1705,2565,{"$f":"ICS[[#This Row],[Admissions (count)]]/ICS[[#This Row],[Patient (count)]]","v":1.5043988269794721},2299.11,0.11195445920303605,0.18785578747628084]
[null,"Patients",{"$f":"_xlfn.XLOOKUP(C5,ICS[ICS Provider View],ICS[Patient (count)],\"\")","v":1595},null,null,"Admissions per biologic patient",{"$f":"C12*(1-ICS!H46)","v":1.0018808777429467},null,null,"Admissions",{"$f":"G12-C8","v":-120.32000000000016},null,null,null,"BARTS HEALTH NHS TRUST",1160,750,8005,{"$f":"Trust[[#This Row],[Total Bed days]]/Trust[[#This Row],[Admissions]]","v":6.9008620689655169},3712.9014965517244,{"$f":"Trust[[#This Row],[Admissions]]/Trust[[#This Row],[Patients]]","v":1.5466666666666666},0.10034602076124567,0.17993079584775087,null,"Cambridgeshire & Peterborough Integrated Care System (I41)",13265,{"$f":"ICS[[#This Row],[Total Bed Days (sum)]]/ICS[[#This Row],[Admissions (count)]]","v":6.3621103117505999},5594499.29,1330,2085,{"$f":"ICS[[#This Row],[Admissions (count)]]/ICS[[#This Row],[Patient (count)]]","v":1.5676691729323309},2703.96,5.9642147117296221E-2,0.12524850894632206]
[null,"Avg. Bed Days",{"$f":"_xlfn.XLOOKUP(C5,ICS[ICS Provider View],ICS[Total Bed Days (average)],\"\")","v":5.6042553191489359},null,null,"Admissions biologic patients",{"$f":"G9*G8","v":255.68},null,null,"Bed days",{"$f":"G16-C13","v":-674.30400000000191},null,null,null,"BEDFORDSHIRE HOSPITALS NHS FOUNDATION TRUST",1405,935,7280,{"$f":"Trust[[#This Row],[Total Bed days]]/Trust[[#This Row],[Admissions]]","v":5.1814946619217084},2929.0694672830723,{"$f":"Trust[[#This Row],[Admissions]]/Trust[[#This Row],[Patients]]","v":1.5026737967914439},8.2758620689655171E-2,0.17241379310344829,null,"Cheshire and Merseyside Health and Care Partnership (I30)",41045,{"$f":"ICS[[#This Row],[Total Bed Days (sum)]]/ICS[[#This Row],[Admissions (count)]]","v":5.2386726228462033},19309457.800000001,5250,7835,{"$f":"ICS[[#This Row],[Admissions (count)]]/ICS[[#This Row],[Patient (count)]]","v":1.4923809523809524},2470.5,8.9084065244667499E-2,0.1794228356336261]
[null,"Avg. Cost per admission",{"$f":"_xlfn.XLOOKUP(C5,ICS[ICS Provider View],ICS[Total Cost (average)],\"\")","v":2574.0100000000002},null,null,"Admissions rest of population",{"$f":"(C9-G8)*C12","v":1973.9999999999998},null,null,null,null,null,null,null,"BERKSHIRE HEALTHCARE NHS FOUNDATION TRUST",7,7,105,{"$f":"Trust[[#This Row],[Total Bed days]]/Trust[[#This Row],[Admissions]]","v":15},4529.6224000000002,{"$f":"Trust[[#This Row],[Admissions]]/Trust[[#This Row],[Patients]]","v":1},"","",null,"Cornwall and the Isles of Scilly Integrated Care System (I09)",3930,{"$f":"ICS[[#This Row],[Total Bed Days (sum)]]/ICS[[#This Row],[Admissions (count)]]","v":4.2950819672131146},1859477.39,560,915,{"$f":"ICS[[#This Row],[Admissions (count)]]/ICS[[#This Row],[Patient (count)]]","v":1.6339285714285714},2032.22,7.6142131979695438E-2,0.13705583756345177]
[null,"Admissions per patient",{"$f":"_xlfn.XLOOKUP(C5,ICS[ICS Provider View],ICS[Admissions per patient],\"\")","v":1.4733542319749215},null,null,"Future Population Admissions",{"$f":"G10+G11","v":2229.6799999999998},null,null,null,null,null,null,null,"BIRMINGHAM WOMEN'S AND CHILDREN'S NHS FOUNDATION TRUST",7,7,15,{"$f":"Trust[[#This Row],[Total Bed days]]/Trust[[#This Row],[Admissions]]","v":2.1428571428571428},9639.7459999999992,{"$f":"Trust[[#This Row],[Admissions]]/Trust[[#This Row],[Patients]]","v":1},"","",null,"Coventry and Warwickshire Integrated Care System (I33)",12715,{"$f":"ICS[[#This Row],[Total Bed Days (sum)]]/ICS[[#This Row],[Admissions (count)]]","v":5.3424369747899156},5490821.3799999999,1605,2380,{"$f":"ICS[[#This Row],[Admissions (count)]]/ICS[[#This Row],[Patient (count)]]","v":1.4828660436137071},2311.92,8.7128712871287123E-2,0.16633663366336635]
[null,"Total Bed Days",{"$f":"_xlfn.XLOOKUP(C5,ICS[ICS Provider View],ICS[Total Bed Days (sum)],\"\")","v":13170},null,null,"Admission cost for biologic pop",{"$f":"G10*ICS!H34","v":945046.43587199994},null,null,null,null,null,null,null,"BLACKPOOL TEACHING HOSPITALS NHS FOUNDATION TRUST",1065,820,6805,{"$f":"Trust[[#This Row],[Total Bed days]]/Trust[[#This Row],[Admissions]]","v":6.389671361502347},2635.6418603773586,{"$f":"Trust[[#This Row],[Admissions]]/Trust[[#This Row],[Patients]]","v":1.2987804878048781},6.8669527896995708E-2,0.13733905579399142,null,"Devon Integrated Care System (I31)",14015,{"$f":"ICS[[#This Row],[Total Bed Days (sum)]]/ICS[[#This Row],[Admissions (count)]]","v":4.7428087986463625},6175084.4199999999,1895,2955,{"$f":"ICS[[#This Row],[Admissions (count)]]/ICS[[#This Row],[Patient (count)]]","v":1.5593667546174141},2093.96,0.10552763819095477,0.20100502512562815]
[null,"Patients eligible for biologics",{"$f":"C9*ICS!H40","v":638},null,null,"Admission cost for rest of pop",{"$f":"G11*ICS!H34","v":7296314.3945999993},null,null,null,null,null,null,null,"BOLTON NHS FOUNDATION TRUST",765,500,5185,{"$f":"Trust[[#This Row],[Total Bed days]]/Trust[[#This Row],[Admissions]]","v":6.7777777777777777},2276.6160681520314,{"$f":"Trust[[#This Row],[Admissions]]/Trust[[#This Row],[Patients]]","v":1.53},0.11560693641618497,0.21965317919075145,null,"Dorset Integrated Care System (I10)",10550,{"$f":"ICS[[#This Row],[Total Bed Days (sum)]]/ICS[[#This Row],[Admissions (count)]]","v":5.0238095238095237},4820387.2,1330,2100,{"$f":"ICS[[#This Row],[Admissions (count)]]/ICS[[#This Row],[Patient (count)]]","v":1.5789473684210527},2293.2399999999998,9.7902097902097904E-2,0.19347319347319347]
[null,"Total Cost",{"$f":"ICS!N27","v":8686088.5649999995},null,null,"Future Total Cost",{"$f":"G13+G14","v":8241360.830471999},null,null,null,null,null,null,null,"BRADFORD TEACHING HOSPITALS NHS FOUNDATION TRUST",785,515,4925,{"$f":"Trust[[#This Row],[Total Bed days]]/Trust[[#This Row],[Admissions]]","v":6.2738853503184711},1786.5118339719027,{"$f":"Trust[[#This Row],[Admissions]]/Trust[[#This Row],[Patients]]","v":1.5242718446601942},0.10752688172043011,0.22043010752688172,null,"Frimley Health and Care (I14)",7390,{"$f":"ICS[[#This Row],[Total Bed Days (sum)]]/ICS[[#This Row],[Admissions (count)]]","v":6.8744186046511624},3233258.88,725,1075,{"$f":"ICS[[#This Row],[Admissions (count)]]/ICS[[#This Row],[Patient (count)]]","v":1.4827586206896552},3016.1,7.9646017699115043E-2,0.16371681415929204]
[null,"Readmission within 30 days",{"$f":"_xlfn.XLOOKUP(C5,ICS[ICS Provider View],ICS[% Readmitted within 30 days])","v":9.355509355509356E-2},null,null,"Future Total Bed Days",{"$f":"G12*C10","v":12495.695999999998},null,null,null,null,null,null,null,"BUCKINGHAMSHIRE HEALTHCARE NHS TRUST",470,350,2410,{"$f":"Trust[[#This Row],[Total Bed days]]/Trust[[#This Row],[Admissions]]","v":5.1276595744680851},2618.480321961621,{"$f":"Trust[[#This Row],[Admissions]]/Trust[[#This Row],[Patients]]","v":1.3428571428571427},9.7087378640776698E-2,0.17475728155339806,null,"Greater Manchester Integrated Care Partnership (I05)",44255,{"$f":"ICS[[#This Row],[Total Bed Days (sum)]]/ICS[[#This Row],[Admissions (count)]]","v":4.9336677814938685},22216665.27,5700,8970,{"$f":"ICS[[#This Row],[Admissions (count)]]/ICS[[#This Row],[Patient (count)]]","v":1.5736842105263158},2480.65,0.12283549783549784,0.22023809523809523]
[null,"Readmission within 90 days",{"$f":"_xlfn.XLOOKUP(C5,ICS[ICS Provider View],ICS[% Readmitted within 90 days],)","v":0.18295218295218296},null,null,null,null,null,null,null,null,null,null,null,"CALDERDALE AND HUDDERSFIELD NHS FOUNDATION TRUST",1110,740,5460,{"$f":"Trust[[#This Row],[Total Bed days]]/Trust[[#This Row],[Admissions]]","v":4.9189189189189193},2213.8214607754735,{"$f":"Trust[[#This Row],[Admissions]]/Trust[[#This Row],[Patients]]","v":1.5},0.11210762331838565,0.21524663677130046,null,"Hampshire and Isle of Wight Integrated Care System (I15)",24570,{"$f":"ICS[[#This Row],[Total Bed Days (sum)]]/ICS[[#This Row],[Admissions (count)]]","v":5.6224256292906176},11355299.300000001,2695,4370,{"$f":"ICS[[#This Row],[Admissions (count)]]/ICS[[#This Row],[Patient (count)]]","v":1.6215213358070502},2608.02,0.13391877058177826,0.24149286498353459]
[null,null,null,null,null,null,null,null,null,null,null,null,null,null,"CAMBRIDGE UNIVERSITY HOSPITALS NHS FOUNDATION TRUST",680,415,4295,{"$f":"Trust[[#This Row],[Total Bed days]]/Trust[[#This Row],[Admissions]]","v":6.3161764705882355},2911.8986941176468,{"$f":"Trust[[#This Row],[Admissions]]/Trust[[#This Row],[Patients]]","v":1.6385542168674698},6.5217391304347824E-2,0.15217391304347827,null,"Herefordshire and Worcestershire Integrated Care System (I34)",8610,{"$f":"ICS[[#This Row],[Total Bed Days (sum)]]/ICS[[#This Row],[Admissions (count)]]","v":5.1556886227544911},4042903.52,1205,1670,{"$f":"ICS[[#This Row],[Admissions (count)]]/ICS[[#This Row],[Patient (count)]]","v":1.3858921161825726},2422.35,7.2463768115942032E-2,0.1391304347826087]
[null,null,null,null,null,null,null,null,null,null,null,null,null,null,"CHELSEA AND WESTMINSTER HOSPITAL NHS FOUNDATION TRUST",900,500,4515,{"$f":"Trust[[#This Row],[Total Bed days]]/Trust[[#This Row],[Admissions]]","v":5.0166666666666666},2701.1338917410708,{"$f":"Trust[[#This Row],[Admissions]]/Trust[[#This Row],[Patients]]","v":1.8},0.13235294117647059,0.23529411764705882,null,"Hertfordshire and West Essex Integrated Care System (I22)",12960,{"$f":"ICS[[#This Row],[Total Bed Days (sum)]]/ICS[[#This Row],[Admissions (count)]]","v":5.5741935483870968},6124308.6100000003,1510,2325,{"$f":"ICS[[#This Row],[Admissions (count)]]/ICS[[#This Row],[Patient (count)]]","v":1.5397350993377483},2635.24,8.3682008368200833E-2,0.16527196652719664]
[null,null,null,null,null,null,null,null,null,null,null,null,null,null,"CHESTERFIELD ROYAL HOSPITAL NHS FOUNDATION TRUST",475,315,2120,{"$f":"Trust[[#This Row],[Total Bed days]]/Trust[[#This Row],[Admissions]]","v":4.4631578947368418},2061.7082801724141,{"$f":"Trust[[#This Row],[Admissions]]/Trust[[#This Row],[Patients]]","v":1.5079365079365079},0.12264150943396226,0.20754716981132076,null,"Humber and North Yorkshire Health and Care Partnership (I01)",23725,{"$f":"ICS[[#This Row],[Total Bed Days (sum)]]/ICS[[#This Row],[Admissions (count)]]","v":5.0640341515474923},11011135.23,3165,4685,{"$f":"ICS[[#This Row],[Admissions (count)]]/ICS[[#This Row],[Patient (count)]]","v":1.4802527646129542},2374.11,0.10691144708423327,0.20302375809935205]
{"$rows_left_out":130}
{"sheet":"Next steps","index":6,"n_rows":0,"n_cols":0,"rows_kept":0,"cut":false,"hidden":false,"merged":[]}

{"sheet":"Create a report","index":7,"n_rows":6,"n_cols":3,"rows_kept":6,"cut":false,"hidden":false,"merged":[]}
[]
[null,"Please fill in the table below and then click the desired report"]
[]
[null,"Your Email Address","judith.hampson@nhs.net"]
[null,"Report created for:","Dr Judith Hampston"]
[null,"Date",{"$f":"TODAY()","v":"2025-08-12"}]

{"sheet":"ICS report","index":8,"n_rows":234,"n_cols":4,"rows_kept":234,"cut":false,"hidden":true,"merged":[]}
[]
[]
[]
[]
[]
[]
[]
[]
[]
[]
[]
[]
[]
[]
[]
[]
[]
[]
[]
[]
{"$rows_left_out":215}
{"sheet":"Trust report","index":9,"n_rows":235,"n_cols":4,"rows_kept":235,"cut":false,"hidden":true,"merged":[]}
[]
[]
[]
[]
[]
[]
[]
[]
[]
[]
[]
[]
[]
[]
[]
[]
[]
[]
[]
[]
{"$rows_left_out":216}
{"sheet":"Report of both","index":10,"n_rows":303,"n_cols":4,"rows_kept":303,"cut":false,"hidden":true,"merged":[]}
[]
[]
[]
[]
[]
[]
[]
[]
[]
[]
[]
[]
[]
[]
[]
[]
[]
[]
[]
[]
{"$rows_left_out":284}
{"sheet":"References","index":11,"n_rows":14,"n_cols":4,"rows_kept":14,"cut":false,"hidden":false,"merged":[]}
[]
[]
[]
[null,"References"]
[]
[null,1,"Bhatt SP, et al. Lancet Reg Health Eur. 2025;13(3):234-243"]
[null,2,"Sanofi Data on File. Hospital Episode Statistics for COPD Fiscal Year 2023-2024"]
[null,3,"Dupixent Summary of Product Characteristics. Great Britain. 2025."]
[null,4,"National Institute for Health and Care Excellence. Clinical Knowledge Summaries. Chronic obstructive pulmonary disease: How common is it? Last revised February 2025. ","https://cks.nice.org.uk/topics/chronic-obstructive-pulmonary-disease/background-information/prevalence-incidence/"]
[null,5,"NHS England. Our work: Respiratory disease. ","https://www.england.nhs.uk/ourwork/clinical-policy/respiratory-disease/"]
[null,6,"NHS England - Transformation Directorate. Digital service to manage high-risk chronic obstructive pulmonary disease (COPD) patients. ","https://transform.england.nhs.uk/key-tools-and-info/digital-playbooks/respiratory-digital-playbook/digital-service-to-manage-high-risk-chronic-obstructive-pulmonary-disease-copd-patients/"]
[null,7,"NHS. The NHS Long Term Plan. 2019. ","https://www.longtermplan.nhs.uk/wp-content/uploads/2019/08/nhs-long-term-plan-version-1.2.pdf"]
[null,8,"NHS England. 2025/26 priorities and operational planning guidance","NHS England » 2025/26 priorities and operational planning guidance"]
[null,9,"Sanofi Data on file. Frequency of Resources Utilised for COPD Hospital Admissions"]